BDBM21484 (2S)-2-{[(1S)-1-carboxy-2-{1-[(4-methylphenyl)methyl]-1H-imidazol-5-yl}ethyl]amino}-4-methylpentanoic acid::Amino dicarboxylate analogue, 11
SMILES CC(C)C[C@H](N[C@@H](Cc1cncn1Cc1ccc(C)cc1)C(O)=O)C(O)=O
InChI Key InChIKey=NPCOBCRLAVXUGB-ROUUACIJSA-N
Data  3 IC50
  Tab Delimited (TSV)   2D SDfile   Computed 3D by Vconf -m prep SDfile
Find this compound or compounds like it in BindingDB:
Activity Spreadsheet -- Enzyme Inhibition Constant Data from BindingDB
Found 1 hit for monomerid = 21484
TargetAngiotensin-converting enzyme 2(Homo sapiens (Human))
Millennium Pharmaceuticals
LigandPNGBDBM21484((2S)-2-{[(1S)-1-carboxy-2-{1-[(4-methylphenyl)meth...)
Affinity DataIC50:  32nMpH: 6.5 T: 2°C. Assay description: Enzyme assay was conducted in 384-well microplates format. Activity was monitored by measuring increase in fluorescence (excitation @320 nm, emission...
In DepthDetails ArticlePubMed